BDBM107468 US8592410, 1::US8592410, 3::US8592410, 62
SMILES C[C@H](N1CC[C@@](CC(C)(C)O)(OC1=O)c1ccccc1)c1ccc(cc1)-c1cnc(=O)n(C)c1
InChI Key InChIKey=KQHDPZNFKMYTEU-PPHZAIPVSA-N
Data  2 IC50
  Tab Delimited (TSV)   2D SDfile   Computed 3D by Vconf -m prep SDfile
Find this compound or compounds like it in BindingDB:
Activity Spreadsheet -- Enzyme Inhibition Constant Data from BindingDB
Found 2 hits for monomerid = 107468
Target11-beta-hydroxysteroid dehydrogenase 1(Homo sapiens (Human))
Vitae Pharmaceuticals
US Patent
LigandPNGBDBM107468(US8592410, 1 | US8592410, 3 | US8592410, 62)
Affinity DataIC50:  29.0nM. Assay description: The inhibition of a microsomal preparation of 11β-HSD1 by compounds of the invention was measured essentially as previously described (K. Solly,...
In DepthDetails US Patent
Target11-beta-hydroxysteroid dehydrogenase 1(Homo sapiens (Human))
Vitae Pharmaceuticals
US Patent
LigandPNGBDBM107468(US8592410, 1 | US8592410, 3 | US8592410, 62)
Affinity DataIC50:  11.3nM. Assay description: The inhibition of a microsomal preparation of 11β-HSD1 by compounds of the invention was measured essentially as previously described (K. Solly,...
In DepthDetails US Patent