BDBM108243 1‐(4‐chlorophenyl)‐2,2,2‐trifluoroethanol (Hit 11)
SMILES OC(c1ccc(Cl)cc1)C(F)(F)F
InChI Key InChIKey=DONAZKZEGGHKRH-UHFFFAOYSA-N
Data  1 IC50
  Tab Delimited (TSV)   2D SDfile   Computed 3D by Vconf -m prep SDfile
Find this compound or compounds like it in BindingDB:
Activity Spreadsheet -- Enzyme Inhibition Constant Data from BindingDB
Found 1 hit for monomerid = 108243
TargetFatty-acid amide hydrolase 1 [33-574](Rattus norvegicus (Rat))
Fondazione Istituto Italiano Di Tecnologia
LigandPNGBDBM108243(1‐(4‐chlorophenyl)‐2,2,2‐t...)
Affinity DataIC50:  1.43E+5nM
In DepthDetails ArticlePubMed