BDBM109606 US8609715, A-28
SMILES CC(Cc1ccc(o1)C(=O)Oc1ccc(cc1)C(N)=N)C(=O)N[C@H](CC(O)=O)C(O)=O
InChI Key InChIKey=SZJWWBVFVRUWES-LNUXAPHWSA-N
Data  2 KI
  Tab Delimited (TSV)   2D SDfile   Computed 3D by Vconf -m prep SDfile
Find this compound or compounds like it in BindingDB:
Activity Spreadsheet -- Enzyme Inhibition Constant Data from BindingDB
Found 2 hits for monomerid = 109606
TargetEnteropeptidase(Homo sapiens (Human))
Ajinomoto
US Patent
LigandPNGBDBM109606(US8609715, A-28)
Affinity DataKi:  0.420nM. Assay description: Inhibition assay using human enteropeptidase.
In DepthDetails US Patent
TargetSerine protease 1(Homo sapiens (Human))
Ajinomoto
US Patent
LigandPNGBDBM109606(US8609715, A-28)
Affinity DataKi:  0.75nM. Assay description: Inhibition assay using human trysin.
In DepthDetails US Patent