BDBM111599 US8623903, I-6
SMILES CCOc1ccc(cc1)S(=O)(=O)N1CCC(CC1)n1cc(C)c2cc(Cl)ccc12
InChI Key InChIKey=BVUZNEVXLOGGOX-UHFFFAOYSA-N
Data  1 IC50
  Tab Delimited (TSV)   2D SDfile   Computed 3D by Vconf -m prep SDfile
Find this compound or compounds like it in BindingDB:
Activity Spreadsheet -- Enzyme Inhibition Constant Data from BindingDB
Found 1 hit for monomerid = 111599
TargetProstaglandin D2 receptor 2(Homo sapiens (Human))
Shionogi
US Patent
LigandPNGBDBM111599(US8623903, I-6)
Affinity DataIC50:  4.80nM. Assay description: A prepared WP was homogenated and a membrane fraction was collected with high-speed centrifugation. A compound of the present invention was added to ...
In DepthDetails US Patent