BDBM111602 US8623903, I-9
SMILES CC(C)Oc1ccc(cc1)S(=O)(=O)N1CCC(CC1)n1cc(C)c2ccc(Cl)cc12
InChI Key InChIKey=QPXOODOHBZQNDD-UHFFFAOYSA-N
Data  1 IC50
  Tab Delimited (TSV)   2D SDfile   Computed 3D by Vconf -m prep SDfile
Find this compound or compounds like it in BindingDB:
Activity Spreadsheet -- Enzyme Inhibition Constant Data from BindingDB
Found 1 hit for monomerid = 111602
TargetProstaglandin D2 receptor 2(Homo sapiens (Human))
Shionogi
US Patent
LigandPNGBDBM111602(US8623903, I-9)
Affinity DataIC50:  2nM. Assay description: A prepared WP was homogenated and a membrane fraction was collected with high-speed centrifugation. A compound of the present invention was added to ...
In DepthDetails US Patent