BDBM111609 US8623903, I-21
SMILES CC(C)Oc1ccc(cc1)S(=O)(=O)N1CC[C@@H](C1)n1nc(CC(O)=O)c2cc(Cl)ccc12
InChI Key InChIKey=DEORNRGQZKVFJO-INIZCTEOSA-N
Data  1 IC50
  Tab Delimited (TSV)   2D SDfile   Computed 3D by Vconf -m prep SDfile
Find this compound or compounds like it in BindingDB:
Activity Spreadsheet -- Enzyme Inhibition Constant Data from BindingDB
Found 1 hit for monomerid = 111609
TargetProstaglandin D2 receptor 2(Homo sapiens (Human))
Shionogi
US Patent
LigandPNGBDBM111609(US8623903, I-21)
Affinity DataIC50:  3nM. Assay description: A prepared WP was homogenated and a membrane fraction was collected with high-speed centrifugation. A compound of the present invention was added to ...
Ligand InfoPC cidPC sid
In DepthDetails US Patent