BDBM111956 US8618107, 268
SMILES CN(C)CCOc1ccc(Nc2cc(cn(C)c2=O)-c2cc(F)cc(N3CCc4c5CCCCc5sc4C3=O)c2CO)nc1
InChI Key InChIKey=VGWRBQGBGNZXBN-UHFFFAOYSA-N
Data  1 IC50
  Tab Delimited (TSV)   2D SDfile   Computed 3D by Vconf -m prep SDfile
Find this compound or compounds like it in BindingDB:
Activity Spreadsheet -- Enzyme Inhibition Constant Data from BindingDB
Found 1 hit for monomerid = 111956
TargetTyrosine-protein kinase BTK(Homo sapiens (Human))
Gilead Connecticut
US Patent
LigandPNGBDBM111956(US8618107, 268)
Affinity DataIC50:  2nMpH: 7.5Assay Description:A generalized procedure for a standard biochemical Btk Kinase Assay that can be used to test Formula I compounds. Alternatively, the Lanthascreen ass...
In DepthDetails US Patent