BDBM111964 US8618107, 276
SMILES Cc1cc(Nc2cc(cn(C)c2=O)-c2cc(F)cc(N3CCn4c5CC(C)(C)Cc5cc4C3=O)c2CO)[nH]n1
InChI Key InChIKey=AQLUMYBSCPDJDB-UHFFFAOYSA-N
Data  1 IC50
  Tab Delimited (TSV)   2D SDfile   Computed 3D by Vconf -m prep SDfile
Find this compound or compounds like it in BindingDB:
Activity Spreadsheet -- Enzyme Inhibition Constant Data from BindingDB
Found 1 hit for monomerid = 111964
TargetTyrosine-protein kinase BTK(Homo sapiens (Human))
Gilead Connecticut
US Patent
LigandPNGBDBM111964(US8618107, 276)
Affinity DataIC50:  2.20nMpH: 7.5Assay Description:A generalized procedure for a standard biochemical Btk Kinase Assay that can be used to test Formula I compounds. Alternatively, the Lanthascreen ass...
In DepthDetails US Patent