BDBM111969 US8618107, 281
SMILES CN1CCC(CC1)c1ccc(Nc2nc(cn(C)c2=O)-c2cc(F)cc(N3CCc4c5CCCCc5sc4C3=O)c2CO)cc1
InChI Key InChIKey=NCIPWTVNNZITQZ-UHFFFAOYSA-N
Data  1 IC50
  Tab Delimited (TSV)   2D SDfile   Computed 3D by Vconf -m prep SDfile
Find this compound or compounds like it in BindingDB:
Activity Spreadsheet -- Enzyme Inhibition Constant Data from BindingDB
Found 1 hit for monomerid = 111969
TargetTyrosine-protein kinase BTK(Homo sapiens (Human))
Gilead Connecticut
US Patent
LigandPNGBDBM111969(US8618107, 281)
Affinity DataIC50:  5.20nMpH: 7.5Assay Description:A generalized procedure for a standard biochemical Btk Kinase Assay that can be used to test Formula I compounds. Alternatively, the Lanthascreen ass...
In DepthDetails US Patent