BDBM111973 US8618107, 285
SMILES CCN1CCn2nc(Nc3cc(cn(C)c3=O)-c3cc(F)cc(N4CCn5c6CC(C)(C)Cc6cc5C4=O)c3CO)cc2C1
InChI Key InChIKey=BVGNIMKXVZGQGZ-UHFFFAOYSA-N
Data  1 IC50
  Tab Delimited (TSV)   2D SDfile   Computed 3D by Vconf -m prep SDfile
Find this compound or compounds like it in BindingDB:
Activity Spreadsheet -- Enzyme Inhibition Constant Data from BindingDB
Found 1 hit for monomerid = 111973
TargetTyrosine-protein kinase BTK(Homo sapiens (Human))
Gilead Connecticut
US Patent
LigandPNGBDBM111973(US8618107, 285)
Affinity DataIC50:  3.60nMpH: 7.5Assay Description:A generalized procedure for a standard biochemical Btk Kinase Assay that can be used to test Formula I compounds. Alternatively, the Lanthascreen ass...
In DepthDetails US Patent