BDBM111977 US8618107, 289
SMILES Cn1cc(cc(Nc2ccc(cn2)N2CCOCC2)c1=O)-c1cc(F)cc(N2CCc3c4CCCCc4sc3C2=O)c1CO
InChI Key InChIKey=GZRXIYDHRQIVER-UHFFFAOYSA-N
Data  1 IC50
  Tab Delimited (TSV)   2D SDfile   Computed 3D by Vconf -m prep SDfile
Find this compound or compounds like it in BindingDB:
Activity Spreadsheet -- Enzyme Inhibition Constant Data from BindingDB
Found 1 hit for monomerid = 111977
TargetTyrosine-protein kinase BTK(Homo sapiens (Human))
Gilead Connecticut
US Patent
LigandPNGBDBM111977(US8618107, 289)
Affinity DataIC50:  5nMpH: 7.5Assay Description:A generalized procedure for a standard biochemical Btk Kinase Assay that can be used to test Formula I compounds. Alternatively, the Lanthascreen ass...
In DepthDetails US Patent