BDBM118957 US11547697, Compound 9::US9682141, 9
SMILES Nc1ncc2cc(ccc2n1)-c1ccc2nccc(-c3ccncc3)c2c1
InChI Key InChIKey=DDTZPVNPYPIQAT-UHFFFAOYSA-N
Data  8 IC50
  Tab Delimited (TSV)   2D SDfile   Computed 3D by Vconf -m prep SDfile
Find this compound or compounds like it in BindingDB:
Activity Spreadsheet -- Enzyme Inhibition Constant Data from BindingDB
Found 8 hits for monomerid = 118957
TargetSerine/threonine-protein kinase mTOR(Homo sapiens (Human))
Intellikine
US Patent
LigandPNGBDBM118957(US11547697, Compound 9 | US9682141, 9)
Affinity DataIC50: >1.00E+4nMT: 2°C. Assay description: The kinase reaction is performed in a white 384 well microtitre plate. The total reaction volume is 20 ul per well and the reaction buffer compositio...
Ligand InfoPC cidPC sid
In DepthDetails US Patent
TargetPhosphatidylinositol 3-kinase regulatory subunit alpha(Homo sapiens (Human))
Intellikine
US Patent
LigandPNGBDBM118957(US11547697, Compound 9 | US9682141, 9)
Affinity DataIC50: <1.00E+3nMT: 2°C. Assay description: Briefly, the assay is a time resolved FRET assay that indirectly measures PIP3 product formed by the activity of a PI3-K. The kinase reaction is perf...
Ligand InfoPC cidPC sid
In DepthDetails US Patent
TargetPhosphatidylinositol 3-kinase regulatory subunit beta(Homo sapiens (Human))
Intellikine
US Patent
LigandPNGBDBM118957(US11547697, Compound 9 | US9682141, 9)
Affinity DataIC50: <1.00E+4nMT: 2°C. Assay description: Briefly, the assay is a time resolved FRET assay that indirectly measures PIP3 product formed by the activity of a PI3-K. The kinase reaction is perf...
Ligand InfoPC cidPC sid
In DepthDetails US Patent
TargetPhosphatidylinositol 4,5-bisphosphate 3-kinase catalytic subunit gamma isoform(Homo sapiens (Human))
Millennium Pharmaceuticals
US Patent
LigandPNGBDBM118957(US11547697, Compound 9 | US9682141, 9)
Affinity DataIC50: <1.00E+3nM. Assay description: An exemplary system is PI 3-Kinase (human) HTRF? Assay from Upstate. The assay can be carried out according to the procedures suggested by the manufa...
Ligand InfoPC cidPC sid
In DepthDetails US Patent
TargetSerine/threonine-protein kinase mTOR(Homo sapiens (Human))
Intellikine
US Patent
LigandPNGBDBM118957(US11547697, Compound 9 | US9682141, 9)
Affinity DataIC50: >1.00E+4nM. Assay description: The compounds described herein can be tested against recombinant mTOR (Invitrogen) in an assay containing 50 mM HEPES, pH 7.5, 1 mM EGTA, 10 mM MgCl2...
Ligand InfoPC cidPC sid
In DepthDetails US Patent
TargetPhosphatidylinositol 4,5-bisphosphate 3-kinase catalytic subunit alpha isoform(Homo sapiens (Human))
Millennium Pharmaceuticals
US Patent
LigandPNGBDBM118957(US11547697, Compound 9 | US9682141, 9)
Affinity DataIC50: <1.00E+3nM. Assay description: An exemplary system is PI 3-Kinase (human) HTRF? Assay from Upstate. The assay can be carried out according to the procedures suggested by the manufa...
Ligand InfoPC cidPC sid
In DepthDetails US Patent
TargetPhosphatidylinositol 4,5-bisphosphate 3-kinase catalytic subunit beta isoform(Homo sapiens (Human))
Millennium Pharmaceuticals
US Patent
LigandPNGBDBM118957(US11547697, Compound 9 | US9682141, 9)
Affinity DataIC50: <1.00E+4nM. Assay description: An exemplary system is PI 3-Kinase (human) HTRF? Assay from Upstate. The assay can be carried out according to the procedures suggested by the manufa...
Ligand InfoPC cidPC sid
In DepthDetails US Patent
TargetPhosphatidylinositol 4,5-bisphosphate 3-kinase catalytic subunit gamma isoform(Homo sapiens (Human))
Millennium Pharmaceuticals
US Patent
LigandPNGBDBM118957(US11547697, Compound 9 | US9682141, 9)
Affinity DataIC50: <1.00E+3nMT: 2°C. Assay description: Briefly, the assay is a time resolved FRET assay that indirectly measures PIP3 product formed by the activity of a PI3-K. The kinase reaction is perf...
Ligand InfoPC cidPC sid
In DepthDetails US Patent