BDBM120490 Roche-Dataset for PDE10A, Compound 743::US8703768, 90
SMILES O=C(Nc1sccc1C(=O)N1CCOCC1)c1nc(ccc1Nc1cncnc1)C1CC1
InChI Key InChIKey=HQBRJUAXXQYPGX-UHFFFAOYSA-N
Data  2 IC50
  Tab Delimited (TSV)   2D SDfile   Computed 3D by Vconf -m prep SDfile
Find this compound or compounds like it in BindingDB:
Activity Spreadsheet -- Enzyme Inhibition Constant Data from BindingDB
Found 2 hits for monomerid = 120490
TargetcAMP and cAMP-inhibited cGMP 3',5'-cyclic phosphodiesterase 10A(Homo sapiens (Human))
F. Hoffmann-La Roche
LigandPNGBDBM120490(Roche-Dataset for PDE10A, Compound 743 | US8703768...)
Affinity DataIC50:  0.440nM. Assay description: Human PDE10A IC50 values were determined by using purified enzyme (Biomol cat. # SE-534) in a scintillation proximity assay (SPA) in 96 well plates (...
In DepthDetails ArticlePubMed
TargetcAMP and cAMP-inhibited cGMP 3',5'-cyclic phosphodiesterase 10A(Homo sapiens (Human))
F. Hoffmann-La Roche
LigandPNGBDBM120490(Roche-Dataset for PDE10A, Compound 743 | US8703768...)
Affinity DataIC50:  0.400nM. Assay description: PDE10 activity of the compounds of the present invention was determined using a Scintillation Proximity Assay (SPA)-based method similar to the one p...
In DepthDetails US Patent