BDBM121397 US8722718, 2
SMILES CC1(OCCCO1)c1ccc(NC(=O)c2ncc([nH]2)C#N)c(c1)C1=CCCCC1
InChI Key InChIKey=VAJNHEUOIQZVIF-UHFFFAOYSA-N
Data  1 IC50
  Tab Delimited (TSV)   2D SDfile   Computed 3D by Vconf -m prep SDfile
Find this compound or compounds like it in BindingDB:
Activity Spreadsheet -- Enzyme Inhibition Constant Data from BindingDB
Found 1 hit for monomerid = 121397
TargetMacrophage colony-stimulating factor 1 receptor(Mus musculus (Mouse))
Janssen Pharmaceutica
US Patent
LigandPNGBDBM121397(US8722718, 2)
Affinity DataIC50:  3.90nMpH: 7.5Assay Description:An autophosphorylation, fluorescence polarization competition immunoassay was used to determine the potency for c-fms inhibition exhibited by selecte...
In DepthDetails US Patent