BDBM122578 US8735386, I-48
SMILES COc1cc(ccc1Nc1ncc2CCc3nn(C)c([C@@H](C)c4ccccc4)c3-c2n1)N1CCN(C)CC1
InChI Key InChIKey=ZAHCXBVRJZIJKZ-FQEVSTJZSA-N
Data  1 IC50
  Tab Delimited (TSV)   2D SDfile   Computed 3D by Vconf -m prep SDfile
Find this compound or compounds like it in BindingDB:
Activity Spreadsheet -- Enzyme Inhibition Constant Data from BindingDB
Found 1 hit for monomerid = 122578
TargetInsulin-like growth factor 1 receptor(Homo sapiens (Human))
Boehringer Ingelheim International
US Patent
LigandPNGBDBM122578(US8735386, I-48)
Affinity DataIC50:  0.690nMpH: 7.4Assay Description:The kinase activity is measured by DELFIA assay (dissociation-enhanced lanthanide fluorescence immunoassay, Perkin Elmer). The cytoplasmic kinase dom...
In DepthDetails US Patent