BDBM122702 US8735386, I-172
SMILES CCn1ccc(Nc2ncc3CCc4nn(C)c(-c5sccc5C)c4-c3n2)n1
InChI Key InChIKey=YPYOXBHZEFZVGO-UHFFFAOYSA-N
Data  1 IC50
  Tab Delimited (TSV)   2D SDfile   Computed 3D by Vconf -m prep SDfile
Find this compound or compounds like it in BindingDB:
Activity Spreadsheet -- Enzyme Inhibition Constant Data from BindingDB
Found 1 hit for monomerid = 122702
TargetInsulin-like growth factor 1 receptor(Homo sapiens (Human))
Boehringer Ingelheim International
US Patent
LigandPNGBDBM122702(US8735386, I-172)
Affinity DataIC50:  0.300nMpH: 7.4Assay Description:The kinase activity is measured by DELFIA assay (dissociation-enhanced lanthanide fluorescence immunoassay, Perkin Elmer). The cytoplasmic kinase dom...
In DepthDetails US Patent