BDBM126750 US8785489, 4-{[({5-[2-(2-fluoropyridin-4-yl)-1H-indol-5-yl]-1-methyl-1H-pyrazol-3-yl}carbonyl)amino]methyl}benzoic acid
SMILES Cn1nc(cc1-c1ccc2[nH]c(cc2c1)-c1ccnc(F)c1)C(=O)NCc1ccc(cc1)C(O)=O
InChI Key InChIKey=HPBSGHQXVPAVMT-UHFFFAOYSA-N
Data  1 IC50
  Tab Delimited (TSV)   2D SDfile   Computed 3D by Vconf -m prep SDfile
Find this compound or compounds like it in BindingDB:
Activity Spreadsheet -- Enzyme Inhibition Constant Data from BindingDB
Found 1 hit for monomerid = 126750
TargetCollagenase 3(Mus musculus (Mouse))
Boehringer Ingelheim International
US Patent
LigandPNGBDBM126750(US8785489, 4-{[({5-[2-(2-fluoropyridin-4-yl)-1H-in...)
Affinity DataIC50:  2nM. Assay description: The EnzoLyte 520 Generic MMP Assay Kit (AnaSpec Inc.) can detect the activity of several MMPs including MMP-1, 2, 3, 7, 8, 9, 13, and 14. This kit us...
In DepthDetails US Patent