BDBM126757 US8785489, 5-methyl-4-[2-(3-methyl-1,2,4-oxadiazol-5-yl)-1H-indol-5-yl]-N-[(2S)-tetrahydrofuran-2-ylmethyl]-1H-imidazole-2-carboxamide
SMILES Cc1noc(n1)-c1cc2cc(ccc2[nH]1)-c1nc([nH]c1C)C(=O)NC[C@@H]1CCCO1
InChI Key InChIKey=XVRHEGHPYISRFU-HNNXBMFYSA-N
Data  1 IC50
  Tab Delimited (TSV)   2D SDfile   Computed 3D by Vconf -m prep SDfile
Find this compound or compounds like it in BindingDB:
Activity Spreadsheet -- Enzyme Inhibition Constant Data from BindingDB
Found 1 hit for monomerid = 126757
TargetCollagenase 3(Mus musculus (Mouse))
Boehringer Ingelheim International
US Patent
LigandPNGBDBM126757(US8785489, 5-methyl-4-[2-(3-methyl-1,2,4-oxadiazol...)
Affinity DataIC50:  4nM. Assay description: The EnzoLyte 520 Generic MMP Assay Kit (AnaSpec Inc.) can detect the activity of several MMPs including MMP-1, 2, 3, 7, 8, 9, 13, and 14. This kit us...
In DepthDetails US Patent