BDBM128378 US8802861, 45
SMILES CCOC(CCNc1nc(cs1)-c1sc(NC(C)=O)nc1C)OCC
InChI Key InChIKey=VPQVLXRHHZLTRS-UHFFFAOYSA-N
Data  1 IC50
  Tab Delimited (TSV)   2D SDfile   Computed 3D by Vconf -m prep SDfile
Find this compound or compounds like it in BindingDB:
Activity Spreadsheet -- Enzyme Inhibition Constant Data from BindingDB
Found 1 hit for monomerid = 128378
LigandPNGBDBM128378(US8802861, 45)
Affinity DataIC50:  612nM. Assay description: The efficacy of compounds of the invention in inhibiting the PI3K induced-lipid phosphorylation may be tested in the following binding assay.The assa...
In DepthDetails US Patent