BDBM128383 US8802861, 136
SMILES CC(=O)Nc1nc(C)c(s1)-c1csc(Nc2cccc(CCC(O)=O)c2)n1
InChI Key InChIKey=KWCOZWQHQYQGDU-UHFFFAOYSA-N
Data  1 IC50
  Tab Delimited (TSV)   2D SDfile   Computed 3D by Vconf -m prep SDfile
Find this compound or compounds like it in BindingDB:
Activity Spreadsheet -- Enzyme Inhibition Constant Data from BindingDB
Found 1 hit for monomerid = 128383
LigandPNGBDBM128383(US8802861, 136)
Affinity DataIC50:  64nM. Assay description: The efficacy of compounds of the invention in inhibiting the PI3K induced-lipid phosphorylation may be tested in the following binding assay.The assa...
In DepthDetails US Patent