BDBM129823 US8815926, 102
SMILES COc1ncc(-c2nc3C(=O)N([C@H](c3n2C(C)C)c2ccc(Cl)cc2)c2cc(Cl)cn(C)c2=O)c(OC)n1
InChI Key InChIKey=AGBSXNCBIWWLHD-FQEVSTJZSA-N
Data  1 KI  3 IC50
PDB links: 1 PDB ID matches this monomer.
  Tab Delimited (TSV)   2D SDfile   Computed 3D by Vconf -m prep SDfile
Find this compound or compounds like it in BindingDB:
Activity Spreadsheet -- Enzyme Inhibition Constant Data from BindingDB
Found 4 hits for monomerid = 129823
TargetE3 ubiquitin-protein ligase Mdm2(Homo sapiens (Human))
International Institute For Translational Chinese Medicine
Curated by ChEMBL
LigandPNGBDBM129823(US8815926, 102)
Affinity DataKi:  0.210nM. Assay description: Inhibition of MDM2 (unknown origin)
TargetProtein Mdm4(Homo sapiens (Human))
Shanghai Institute Of Materia Medica
Curated by ChEMBL
LigandPNGBDBM129823(US8815926, 102)
Affinity DataIC50:  3.00E+3nM. Assay description: Inhibition of human MDM4 by TR-FRET assay
In DepthDetails PubMed
TargetE3 ubiquitin-protein ligase Mdm2(Homo sapiens (Human))
International Institute For Translational Chinese Medicine
Curated by ChEMBL
LigandPNGBDBM129823(US8815926, 102)
Affinity DataIC50:  0.210nM. Assay description: Inhibition of human MDM2 by TR-FRET assay
TargetE3 ubiquitin-protein ligase Mdm2(Homo sapiens (Human))
International Institute For Translational Chinese Medicine
Curated by ChEMBL
LigandPNGBDBM129823(US8815926, 102)
Affinity DataIC50:  0.230nM. Assay description: The inhibition of p53-MDM2 and p53-MDM4 interactions is measured by time resolved fluorescence energy transfer (TR-FRET). Fluorescence energy transfe...