BDBM130920 US8822500, [24]
SMILES CC(Cc1c(F)c(F)cc(F)c1F)Nc1cc[nH]c(=O)c1-c1nc2cc3CN(C4CCN(C)CC4)C(=O)c3c(C)c2[nH]1
InChI Key InChIKey=XBJCMGUGQRINQY-UHFFFAOYSA-N
Data  2 IC50
  Tab Delimited (TSV)   2D SDfile   Computed 3D by Vconf -m prep SDfile
Find this compound or compounds like it in BindingDB:
Activity Spreadsheet -- Enzyme Inhibition Constant Data from BindingDB
Found 2 hits for monomerid = 130920
TargetHigh affinity nerve growth factor receptor(Homo sapiens (Human))
Chembridge
US Patent
LigandPNGBDBM130920(US8822500, [24])
Affinity DataIC50:  10.4nMpH: 7.5Assay Description:Compounds to be tested were dissolved in 100% DMSO in a range of concentrations from 10-8 to 10-3 M including negative control (DMSO), then diluted w...
In DepthDetails US Patent
TargetSerine/threonine-protein kinase receptor R3(Homo sapiens (Human))
Chembridge
US Patent
LigandPNGBDBM130920(US8822500, [24])
Affinity DataIC50:  23.7nMpH: 7.5Assay Description:Compounds to be tested were dissolved in 100% DMSO in a range of concentrations from 10-8 to 10-3 M including negative control (DMSO), then diluted w...
In DepthDetails US Patent