BDBM132038 US8841455, 133
SMILES CN1CCN(CCOc2ccn3c(cnc3c2)C(=O)Nc2cccc3n(Cc4cnc(C)s4)nc(I)c23)CC1
InChI Key InChIKey=JYJSLERSUMRWQZ-UHFFFAOYSA-N
Data  1 IC50
  Tab Delimited (TSV)   2D SDfile   Computed 3D by Vconf -m prep SDfile
Find this compound or compounds like it in BindingDB:
Activity Spreadsheet -- Enzyme Inhibition Constant Data from BindingDB
Found 1 hit for monomerid = 132038
TargetMacrophage colony-stimulating factor 1 receptor(Homo sapiens (Human))
Array Biopharma
US Patent
LigandPNGBDBM132038(US8841455, 133)
Affinity DataIC50:  183nMpH: 7.3 T: 2°C. Assay description: The ability of compounds of Formula I to inhibit cFMS was determined by the following assay. cFMS enzymatic activity was measured using the LANCE Ult...
Ligand InfoPC cidPC sid
In DepthDetails US Patent