BDBM138359 US10278929, Compound 9::US11337935, Compound 9::US8877795, 9
SMILES CCOc1ccccc1-c1nc(no1)-c1ccncc1
InChI Key InChIKey=KGGKTXHZJKALQU-UHFFFAOYSA-N
Data  3 IC50
PDB links: 1 PDB ID matches this monomer.
  Tab Delimited (TSV)   2D SDfile   Computed 3D by Vconf -m prep SDfile
Find this compound or compounds like it in BindingDB:
Activity Spreadsheet -- Enzyme Inhibition Constant Data from BindingDB
Found 1 hit for monomerid = 138359
TargetTransthyretin(Homo sapiens (Human))
The Board of Trustees of The Leland Stanford Junior University
US Patent
LigandPNGBDBM138359(US10278929, Compound 9 | US11337935, Compound 9 | ...)
Affinity DataIC50:  329nM. Assay description: The FP assay was then adapted for HTS and used to screen a ˜120,000 member small molecule library for compounds that displaced the FP probe from the ...