BDBM138361 US8877795, Meclofenamic Acid
SMILES Cc1ccc(O)c(Nc2ccccc2C(O)=O)c1Cl
InChI Key InChIKey=KIGPXNGSSJLSBH-UHFFFAOYSA-N
Data  1 IC50
  Tab Delimited (TSV)   2D SDfile   Computed 3D by Vconf -m prep SDfile
Find this compound or compounds like it in BindingDB:
Activity Spreadsheet -- Enzyme Inhibition Constant Data from BindingDB
Found 1 hit for monomerid = 138361
TargetTransthyretin(Homo sapiens (Human))
The Board of Trustees of The Leland Stanford Junior University
US Patent
LigandPNGBDBM138361(US8877795, Meclofenamic Acid)
Affinity DataIC50:  504nM. Assay description: The FP assay was then adapted for HTS and used to screen ~120,000 small molecule library for compounds that displaced probe 5 from the T4 binding of ...
Ligand InfoPC cidPC sid
In DepthDetails US Patent