BDBM138512 US8877775, 23::US9073869, 23
SMILES Fc1cc(cc(F)c1F)-c1ccc(C[C@H](NC(=O)[C@H]2NC3CCC2CC3)C#N)cc1
InChI Key InChIKey=ASHCBEYYVNPBGG-DRHHIBKESA-N
Data  2 IC50
  Tab Delimited (TSV)   2D SDfile   Computed 3D by Vconf -m prep SDfile
Find this compound or compounds like it in BindingDB:
Activity Spreadsheet -- Enzyme Inhibition Constant Data from BindingDB
Found 2 hits for monomerid = 138512
TargetDipeptidyl peptidase 1(Homo sapiens (Human))
Boehringer Ingelheim International
US Patent
LigandPNGBDBM138512(US8877775, 23 | US9073869, 23)
Affinity DataIC50:  244nMT: 2°C. Assay description: The recombinant human DPPI was diluted in TAGZyme buffer to 1 U/ml (38.1 ug/ml, respectively), and then activated by mixing in a 1:2 ratio with a Cys...
In DepthDetails US Patent
TargetDipeptidyl peptidase 1(Homo sapiens (Human))
Boehringer Ingelheim International
US Patent
LigandPNGBDBM138512(US8877775, 23 | US9073869, 23)
Affinity DataIC50:  244nMpH: 6.0 T: 2°C. Assay description: The following buffers were used: MES buffer: 25 mM MES, 50 mM NaCl, 5 mM DTT, adjusted to pH 6.0, containing 0.1% BSA; TAGZyme Buffer: 20 mM NaH2P04,...
In DepthDetails US Patent