BDBM13957 2-(Naphthalen-2-yloxalylamino)benzoic Acid::2-(naphthalen-2-ylamidoformic acid)benzoic acid::Oxalylarylaminobenzoic Acid Analog 8a
SMILES OC(=O)C(=O)N(c1ccc2ccccc2c1)c1ccccc1C(O)=O
InChI Key InChIKey=LLOOCOKYIDOTEO-UHFFFAOYSA-N
Data  2 KI  1 Kd
  Tab Delimited (TSV)   2D SDfile   Computed 3D by Vconf -m prep SDfile
Find this compound or compounds like it in BindingDB:
Activity Spreadsheet -- Enzyme Inhibition Constant Data from BindingDB
Found 2 hits for monomerid = 13957
TargetTyrosine-protein phosphatase non-receptor type 1 [1-298](Homo sapiens (Human))
Abbott Laboratories
LigandPNGBDBM13957(2-(Naphthalen-2-yloxalylamino)benzoic Acid | 2-(na...)
Affinity DataKi:  3.90E+4nM ΔG°:  -5.95kcal/mole Kd:  1.10E+4nMpH: 7.5 T: 2°C. Assay description: The phosphatase activity resulted in the formation of the colored product p-nitrophenol, which was continuously monitored at 405 nm every 30 s for 15...
In DepthDetails ArticlePubMed
TargetTyrosine-protein phosphatase non-receptor type 1(Homo sapiens (Human))
Abbott Laboratories
Curated by ChEMBL
LigandPNGBDBM13957(2-(Naphthalen-2-yloxalylamino)benzoic Acid | 2-(na...)
Affinity DataKi:  3.98E+4nM. Assay description: Inhibition of PTP1B
In DepthDetails ArticlePubMed