BDBM13961 2-[(2-Isopropylphenyl)oxalylamino]benzoic Acid::2-{[2-(propan-2-yl)phenyl]amidoformic acid}benzoic acid::Oxalylarylaminobenzoic Acid Analog 8e
SMILES CC(C)c1ccccc1N(C(=O)C(O)=O)c1ccccc1C(O)=O
InChI Key InChIKey=NRZDCLRWAQENQQ-UHFFFAOYSA-N
Data  1 KI  1 Kd
  Tab Delimited (TSV)   2D SDfile   Computed 3D by Vconf -m prep SDfile
Find this compound or compounds like it in BindingDB:
Activity Spreadsheet -- Enzyme Inhibition Constant Data from BindingDB
Found 1 hit for monomerid = 13961
TargetTyrosine-protein phosphatase non-receptor type 1 [1-298](Homo sapiens (Human))
Abbott Laboratories
LigandPNGBDBM13961(2-[(2-Isopropylphenyl)oxalylamino]benzoic Acid | 2...)
Affinity DataKi:  3.50E+4nM ΔG°:  -6.01kcal/mole Kd:  4.90E+4nMpH: 7.5 T: 2°C. Assay description: The phosphatase activity resulted in the formation of the colored product p-nitrophenol, which was continuously monitored at 405 nm every 30 s for 15...
In DepthDetails ArticlePubMed