BDBM139698 US8895544, 10
SMILES CCc1cc(O)c(F)cc1-c1ccc2c(n[nH]c2c1)-c1nc2CCN(CCc2[nH]1)C(=O)c1ccc(F)cc1
InChI Key InChIKey=XTSYILHHSBYBSJ-UHFFFAOYSA-N
Data  2 IC50
  Tab Delimited (TSV)   2D SDfile   Computed 3D by Vconf -m prep SDfile
Find this compound or compounds like it in BindingDB:
Activity Spreadsheet -- Enzyme Inhibition Constant Data from BindingDB
Found 2 hits for monomerid = 139698
TargetTyrosine-protein kinase JAK1(Homo sapiens (Human))
Pfizer
US Patent
LigandPNGBDBM139698(US8895544, 10)
Affinity DataIC50:  4.5nMpH: 7.5 T: 2°C. Assay description: JAK1 enzyme (Invitrogen) stock solution is made up at 5.2 uM in sterile water. JAK1 enzyme stock is diluted to 20 nM in assay buffer (10 mM HEPES fre...
In DepthDetails US Patent
TargetTyrosine-protein kinase JAK3(Homo sapiens (Human))
Pfizer
US Patent
LigandPNGBDBM139698(US8895544, 10)
Affinity DataIC50:  1.30nMpH: 7.5 T: 2°C. Assay description: JAK3 enzyme (Invitrogen) stock solution is made up at 4.1 uM in sterile water. JAK3 enzyme stock is diluted to 2 nM in assay buffer (10 mM HEPES free...
In DepthDetails US Patent