BDBM139767 US8895581, I-3
SMILES Fc1ccc(Cn2cncc(C(=O)NCC#Cc3ccc4ncc5ncn(C6CCC6)c5c4c3)c2=O)cc1F
InChI Key InChIKey=NFZLVQBLSROCKG-UHFFFAOYSA-N
Data  1 IC50
  Tab Delimited (TSV)   2D SDfile   Computed 3D by Vconf -m prep SDfile
Find this compound or compounds like it in BindingDB:
Activity Spreadsheet -- Enzyme Inhibition Constant Data from BindingDB
Found 1 hit for monomerid = 139767
Target3-phosphoinositide-dependent protein kinase 1(Homo sapiens (Human))
Boehringer Ingelheim International
US Patent
LigandPNGBDBM139767(US8895581, I-3)
Affinity DataIC50:  4nMpH: 7.5Assay Description:Recombinant human PDK1 enzyme (aa 52-556) linked at its N-terminal end to His6 is isolated from baculovirus-infected insect cells. Purified enzyme ma...
In DepthDetails US Patent