BDBM139776 US8895581, I-12
SMILES Fc1ccc(Cn2cncc(C(=O)NCC#Cc3ccc4ncc5ncn([C@H]6CCCNC6)c5c4c3)c2=O)cc1F
InChI Key InChIKey=PBQPDDGAQCGMDU-NRFANRHFSA-N
Data  1 IC50
  Tab Delimited (TSV)   2D SDfile   Computed 3D by Vconf -m prep SDfile
Find this compound or compounds like it in BindingDB:
Activity Spreadsheet -- Enzyme Inhibition Constant Data from BindingDB
Found 1 hit for monomerid = 139776
Target3-phosphoinositide-dependent protein kinase 1(Homo sapiens (Human))
Boehringer Ingelheim International
US Patent
LigandPNGBDBM139776(US8895581, I-12)
Affinity DataIC50:  9nMpH: 7.5Assay Description:Recombinant human PDK1 enzyme (aa 52-556) linked at its N-terminal end to His6 is isolated from baculovirus-infected insect cells. Purified enzyme ma...
In DepthDetails US Patent