BDBM139783 US8895581, II-4
SMILES CC(C)n1c(C)nc2cnc3ccc(cc3c12)C#CCNC(=O)c1cc(Cl)nn(Cc2ccc(F)c(F)c2)c1=O
InChI Key InChIKey=RECGDQSHJPMUMK-UHFFFAOYSA-N
Data  1 IC50
  Tab Delimited (TSV)   2D SDfile   Computed 3D by Vconf -m prep SDfile
Find this compound or compounds like it in BindingDB:
Activity Spreadsheet -- Enzyme Inhibition Constant Data from BindingDB
Found 1 hit for monomerid = 139783
Target3-phosphoinositide-dependent protein kinase 1(Homo sapiens (Human))
Boehringer Ingelheim International
US Patent
LigandPNGBDBM139783(US8895581, II-4)
Affinity DataIC50:  5nMpH: 7.5Assay Description:Recombinant human PDK1 enzyme (aa 52-556) linked at its N-terminal end to His6 is isolated from baculovirus-infected insect cells. Purified enzyme ma...
In DepthDetails US Patent