BDBM139821 US8895581, III-7
SMILES Cc1nc2cnc3ccc(cc3c2n1CCc1ccccc1)C#CCNC(=O)c1cc(Cl)nn(Cc2ccc(F)c(F)c2)c1=O
InChI Key InChIKey=BVVUJTUILFYYQO-UHFFFAOYSA-N
Data  1 IC50
  Tab Delimited (TSV)   2D SDfile   Computed 3D by Vconf -m prep SDfile
Find this compound or compounds like it in BindingDB:
Activity Spreadsheet -- Enzyme Inhibition Constant Data from BindingDB
Found 1 hit for monomerid = 139821
Target3-phosphoinositide-dependent protein kinase 1(Homo sapiens (Human))
Boehringer Ingelheim International
US Patent
LigandPNGBDBM139821(US8895581, III-7)
Affinity DataIC50:  7nMpH: 7.5Assay Description:Recombinant human PDK1 enzyme (aa 52-556) linked at its N-terminal end to His6 is isolated from baculovirus-infected insect cells. Purified enzyme ma...
In DepthDetails US Patent