BDBM139839 US8895581, III-25
SMILES CN(C)[C@H]1CC[C@H](CC1)n1c(C)nc2cnc3ccc(cc3c12)C#CCNC(=O)c1cccn([C@@H](CO)c2cccc(F)c2)c1=O
InChI Key InChIKey=WBNQWVSRZDTTCD-DWZXRANWSA-N
Data  1 IC50
  Tab Delimited (TSV)   2D SDfile   Computed 3D by Vconf -m prep SDfile
Find this compound or compounds like it in BindingDB:
Activity Spreadsheet -- Enzyme Inhibition Constant Data from BindingDB
Found 1 hit for monomerid = 139839
Target3-phosphoinositide-dependent protein kinase 1(Homo sapiens (Human))
Boehringer Ingelheim International
US Patent
LigandPNGBDBM139839(US8895581, III-25)
Affinity DataIC50:  4nMpH: 7.5Assay Description:Recombinant human PDK1 enzyme (aa 52-556) linked at its N-terminal end to His6 is isolated from baculovirus-infected insect cells. Purified enzyme ma...
In DepthDetails US Patent