BDBM141539 US8921404, 4
SMILES CC1CCN(CC1)C(=O)Oc1nsc2ncccc12
InChI Key InChIKey=BKZYFLXAEJOXJL-UHFFFAOYSA-N
Data  1 IC50
  Tab Delimited (TSV)   2D SDfile   Computed 3D by Vconf -m prep SDfile
Find this compound or compounds like it in BindingDB:
Activity Spreadsheet -- Enzyme Inhibition Constant Data from BindingDB
Found 1 hit for monomerid = 141539
TargetHormone-sensitive lipase(Rattus norvegicus (Rat))
Sanofi
US Patent
LigandPNGBDBM141539(US8921404, 4)
Affinity DataIC50:  100nMpH: 7.0 T: 2°C. Assay description: To prepare the substrate, 25-50 uCi of [3H]trioleoylglycerol (in toluene), 6.8 umol of unlabeled trioleoylglycerol and 0.6 mg of phospholipids (phosp...
Ligand InfoPC cidPC sid
In DepthDetails US Patent