BDBM141986 US8927534, 262
SMILES Cc1ccnc(NCC2CCN(CC2)c2ccc(CC(NC(=O)c3ccccc3)C(O)=O)cc2)c1
InChI Key InChIKey=RYVSEJYVROGWSK-UHFFFAOYSA-N
Data  2 IC50
  Tab Delimited (TSV)   2D SDfile   Computed 3D by Vconf -m prep SDfile
Find this compound or compounds like it in BindingDB:
Activity Spreadsheet -- Enzyme Inhibition Constant Data from BindingDB
Found 2 hits for monomerid = 141986
TargetIntegrin alpha-IIb(Homo sapiens (Human))
Shire Orphan Therapies
US Patent
LigandPNGBDBM141986(US8927534, 262)
Affinity DataIC50: >1.00E+3nMpH: 9.6 T: 2°C. Assay description: Fibrinogen was diluted with coating buffer (15 mM Na2CO3, 35 mM NaHCO3, pH 9.6) and coated with 100 uL/well to Nunc-Immuno maxisorp plates over night...
In DepthDetails US Patent
TargetIntegrin alpha-5(Homo sapiens (Human))
Shire Orphan Therapies
US Patent
LigandPNGBDBM141986(US8927534, 262)
Affinity DataIC50: <100nMpH: 9.6 T: 2°C. Assay description: Fibronectin was diluted with coating buffer (15 mM Na2CO3, 35 mM NaHCO3, pH 9.6) and coated with 100 uL/well to Nunc-Immuno maxisorp plates (Nalge Nu...
In DepthDetails US Patent