BDBM142804 US8940736, 221
SMILES OCC1(CO)CC(C1)N1CCC(CC1)c1cc(cc(Nc2nc(NC3CC3)c3ncc(C#N)n3n2)c1Cl)C#N
InChI Key InChIKey=OGNVMYSSYUFMFO-UHFFFAOYSA-N
Data  2 IC50
  Tab Delimited (TSV)   2D SDfile   Computed 3D by Vconf -m prep SDfile
Find this compound or compounds like it in BindingDB:
Activity Spreadsheet -- Enzyme Inhibition Constant Data from BindingDB
Found 2 hits for monomerid = 142804
TargetCasein kinase II subunit alpha'(Homo sapiens (Human))
Bristol-Myers Squibb
US Patent
LigandPNGBDBM142804(US8940736, 221)
Affinity DataIC50:  0.760nMpH: 7.4 T: 2°C. Assay description: The effectiveness of compounds of the present invention as inhibitors of protein kinases can be readily tested by assays known to those skilled in th...
In DepthDetails US Patent
TargetCasein kinase II subunit alpha(Homo sapiens (Human))
Bristol-Myers Squibb
US Patent
LigandPNGBDBM142804(US8940736, 221)
Affinity DataIC50:  1.34nMpH: 7.4 T: 2°C. Assay description: The effectiveness of compounds of the present invention as inhibitors of protein kinases can be readily tested by assays known to those skilled in th...
In DepthDetails US Patent