BDBM14412 5-(2-butoxy-5-acetylpyridin-3-yl)-3-ethyl-2-(1-methylpiperidin-4-yl)-2H,6H,7H-pyrazolo[4,3-d]pyrimidin-7-one::5-(5-Acetyl-2-butoxy-3-pyridinyl)-3-ethyl-2-(1-methyl-4-piperidinyl)-2,6-dihydro-7H-pyrazolo[4,3-d]pyrimidin-7-one::Sildenafil 5-methyl ketone analogue 34
SMILES CCCCOc1ncc(cc1-c1nc2c(CC)n(nc2c(=O)[nH]1)C1CCN(C)CC1)C(C)=O
InChI Key InChIKey=VSENBPHLXIVGAC-UHFFFAOYSA-N
Data  1 IC50
  Tab Delimited (TSV)   2D SDfile   Computed 3D by Vconf -m prep SDfile
Find this compound or compounds like it in BindingDB:
Activity Spreadsheet -- Enzyme Inhibition Constant Data from BindingDB
Found 1 hit for monomerid = 14412
TargetcGMP-specific 3',5'-cyclic phosphodiesterase(Homo sapiens (Human))
Pfizer
LigandPNGBDBM14412(5-(2-butoxy-5-acetylpyridin-3-yl)-3-ethyl-2-(1-met...)
Affinity DataIC50:  9.10nM. Assay description: PDE5 or PDE6 catalytic activity was monitored by measuring the hydrolysis of [3H]-cGMP to [3H]-GMP using a scintillation proximity assay (SPA). [3H]-...
In DepthDetails ArticlePubMed