BDBM144385 US8969358, 136
SMILES COC12CC[C@@]3(C[C@@H]1CNC(=O)Nc1ccccc1)[C@H]1Cc4ccc(O)c5O[C@@H]2[C@]3(CCN1CC1CC1)c45
InChI Key InChIKey=LVRKAXGZXAYESI-JWCVBAGJSA-N
Data  1 KI
  Tab Delimited (TSV)   2D SDfile   Computed 3D by Vconf -m prep SDfile
Find this compound or compounds like it in BindingDB:
Activity Spreadsheet -- Enzyme Inhibition Constant Data from BindingDB
Found 1 hit for monomerid = 144385
TargetKappa-type opioid receptor(Homo sapiens (Human))
Purdue Pharma
US Patent
LigandPNGBDBM144385(US8969358, 136)
Affinity DataKi:  0.0800nM ΔG°:  -12.8kcal/molepH: 7.4 T: 2°C. Assay description: Kippa-Opioid Receptor Binding Assay Procedures: Membranes from recombinant HEK-293 cells expressing the human kippa opioid receptor (kippa) (cloned i...
In DepthDetails US Patent