BDBM149381 US8975247, EBP882
SMILES Cc1cc2nc(CC3CC4CCC(C3)N4)n(Cc3ccc(Cl)cc3)c2cc1C
InChI Key InChIKey=RDLMLSUNDFYREW-UHFFFAOYSA-N
Data  1 IC50
  Tab Delimited (TSV)   2D SDfile   Computed 3D by Vconf -m prep SDfile
Find this compound or compounds like it in BindingDB:
Activity Spreadsheet -- Enzyme Inhibition Constant Data from BindingDB
Found 1 hit for monomerid = 149381
TargetPotassium voltage-gated channel subfamily H member 2(Homo sapiens (Human))
The Board of Trustees of The Leland Stanford Junion University
US Patent
LigandPNGBDBM149381(US8975247, EBP882)
Affinity DataIC50:  4.30E+3nM. Assay description: Drugs belonging to different classes have been shown to be associated with QT prolongation and in some cases serious ventricular arrhythmias. The mos...
In DepthDetails US Patent