BDBM149391 US8975247, EBP106
SMILES Clc1ccc(Cn2c(nc3cc(Cl)c(Cl)cc23)-c2ccc(=O)[nH]c2)cc1Cl
InChI Key InChIKey=VNRLFXIUGYIZQF-UHFFFAOYSA-N
Data  1 IC50
  Tab Delimited (TSV)   2D SDfile   Computed 3D by Vconf -m prep SDfile
Find this compound or compounds like it in BindingDB:
Activity Spreadsheet -- Enzyme Inhibition Constant Data from BindingDB
Found 1 hit for monomerid = 149391
TargetPotassium voltage-gated channel subfamily H member 2(Homo sapiens (Human))
The Board of Trustees of The Leland Stanford Junion University
US Patent
LigandPNGBDBM149391(US8975247, EBP106)
Affinity DataIC50:  5.00E+3nM. Assay description: Drugs belonging to different classes have been shown to be associated with QT prolongation and in some cases serious ventricular arrhythmias. The mos...
In DepthDetails US Patent