BDBM149407 US10434101, Compound I-7::US11096942, Compound I-7::US8975249, I-7
SMILES COc1cc(ccc1Nc1ncc(c(Nc2cccc(NC(=O)C=C)c2)n1)C(F)(F)F)N1CCCN(CC1)C(C)=O
InChI Key InChIKey=DXLOPZBHQGBEJJ-UHFFFAOYSA-N
Data  6 IC50
  Tab Delimited (TSV)   2D SDfile   Computed 3D by Vconf -m prep SDfile
Find this compound or compounds like it in BindingDB:
Activity Spreadsheet -- Enzyme Inhibition Constant Data from BindingDB
Found 6 hits for monomerid = 149407
TargetEpidermal growth factor receptor(Homo sapiens (Human))
Celgene Avilomics Research
US Patent
LigandPNGBDBM149407(US10434101, Compound I-7 | US11096942, Compound I-...)
Affinity DataIC50:  20nMpH: 7.5Assay Description:Briefly, 10x stocks of EGFR-WT (PV3872) from Invitrogen and EGFR-T790M/L858R (40350) from BPS Bioscience, San Diego, Calif., 1.13xATP (AS001A) and ap...
In DepthDetails US Patent
TargetEpidermal growth factor receptor(Homo sapiens (Human))
Celgene Avilomics Research
US Patent
LigandPNGBDBM149407(US10434101, Compound I-7 | US11096942, Compound I-...)
Affinity DataIC50: <1nMpH: 7.5Assay Description:Briefly, 10x stocks of EGFR-WT (PV3872) from Invitrogen and EGFR-T790M/L858R (40350) from BPS Bioscience, San Diego, Calif., 1.13xATP (AS001A) and ap...
In DepthDetails US Patent
TargetEpidermal growth factor receptor [T790M,L858R](Homo sapiens (Human))
Celgene Car
US Patent
LigandPNGBDBM149407(US10434101, Compound I-7 | US11096942, Compound I-...)
Affinity DataIC50: <1nM. Assay description: Briefly, 10× stocks of EGFR-WT (PV3872) from Invitrogen and EGFR-T790M/L858R (40350) from BPS Bioscience, San Diego, Calif., 1.13×ATP (AS001A) and ap...
In DepthDetails US Patent
TargetEpidermal growth factor receptor [T790M,L858R](Homo sapiens (Human))
Celgene Car
US Patent
LigandPNGBDBM149407(US10434101, Compound I-7 | US11096942, Compound I-...)
Affinity DataIC50: <1nM. Assay description: Briefly, 10× stocks of EGFR-WT (PV3872) from Invitrogen and EGFR-T790M/L858R (40350) from BPS Bioscience, San Diego, Calif., 1.13×ATP (AS001A) and ap...
In DepthDetails US Patent
TargetEpidermal growth factor receptor(Homo sapiens (Human))
Celgene Avilomics Research
US Patent
LigandPNGBDBM149407(US10434101, Compound I-7 | US11096942, Compound I-...)
Affinity DataIC50:  20nM. Assay description: Briefly, 10× stocks of EGFR-WT (PV3872) from Invitrogen and EGFR-T790M/L858R (40350) from BPS Bioscience, San Diego, Calif., 1.13×ATP (AS001A) and ap...
In DepthDetails US Patent
TargetEpidermal growth factor receptor(Homo sapiens (Human))
Celgene Avilomics Research
US Patent
LigandPNGBDBM149407(US10434101, Compound I-7 | US11096942, Compound I-...)
Affinity DataIC50:  20nM. Assay description: Briefly, 10× stocks of EGFR-WT (PV3872) from Invitrogen and EGFR-T790M/L858R (40350) from BPS Bioscience, San Diego, Calif., 1.13×ATP (AS001A) and ap...
In DepthDetails US Patent