BDBM149691 US8975267, 33
SMILES CSc1ncc2CCc3c(cn([C@@H]4CC[C@H](N)CC4)c3-c2n1)C(N)=O
InChI Key InChIKey=BRAYMNJVFKIQLD-TXEJJXNPSA-N
Data  3 IC50
  Tab Delimited (TSV)   2D SDfile   Computed 3D by Vconf -m prep SDfile
Find this compound or compounds like it in BindingDB:
Activity Spreadsheet -- Enzyme Inhibition Constant Data from BindingDB
Found 3 hits for monomerid = 149691
TargetDual specificity protein kinase TTK(Homo sapiens (Human))
Nerviano Medical Sciences
US Patent
LigandPNGBDBM149691(US8975267, 33)
Affinity DataIC50:  1.55E+3nMpH: 3.0Assay Description:Specific peptide or protein substrates are trans-phosphorylated by their specific ser-thr or tyr kinase in the presence of ATP traced with 33P-gamma-...
In DepthDetails US Patent
TargetSerine/threonine-protein kinase pim-2(Homo sapiens (Human))
Nerviano Medical Sciences
US Patent
LigandPNGBDBM149691(US8975267, 33)
Affinity DataIC50:  7nMpH: 7.5Assay Description:The buffer for PIM-2 assay was composed of HEPES 50 mM, at pH 7.5, with 1 mM MgCl2, 1 mM DTT, 3 microM Na3VO4, and 0.2 mg/mL BSAFull-length human PIM...
In DepthDetails US Patent
TargetSerine/threonine-protein kinase pim-1(Homo sapiens (Human))
Nerviano Medical Sciences
US Patent
LigandPNGBDBM149691(US8975267, 33)
Affinity DataIC50:  5nMpH: 3.0Assay Description:Specific peptide or protein substrates are trans-phosphorylated by their specific ser-thr or tyr kinase in the presence of ATP traced with 33P-gamma-...
In DepthDetails US Patent