BDBM15016 Ethyl 5-[(tert-Butylamino)carbonyl]-4-ethyl-2-formyl-1Hpyrrole-3-carboxylate::Pyrrole Analogue 6::ethyl 5-(tert-butylcarbamoyl)-4-ethyl-2-formyl-1H-pyrrole-3-carboxylate
SMILES CCOC(=O)c1c(CC)c([nH]c1C=O)C(=O)NC(C)(C)C
InChI Key InChIKey=PQNURZDCFRKQQG-UHFFFAOYSA-N
Data  2 IC50
  Tab Delimited (TSV)   2D SDfile   Computed 3D by Vconf -m prep SDfile
Find this compound or compounds like it in BindingDB:
Activity Spreadsheet -- Enzyme Inhibition Constant Data from BindingDB
Found 2 hits for monomerid = 15016
TargetInsulin-like growth factor 1 receptor(Homo sapiens (Human))
Merck Research Laboratories
LigandPNGBDBM15016(Ethyl 5-[(tert-Butylamino)carbonyl]-4-ethyl-2-form...)
Affinity DataIC50:  2.60E+3nMpH: 7.4 T: 2°C. Assay description: The assay uses purified enzyme interacting with biotinylated peptide substrate.HTRF is based on the proximity of europium cryptate (donor fluorophore...
In DepthDetails ArticlePubMed
TargetInsulin receptor(Homo sapiens (Human))
Merck Research Laboratories
LigandPNGBDBM15016(Ethyl 5-[(tert-Butylamino)carbonyl]-4-ethyl-2-form...)
Affinity DataIC50:  1.70E+4nMpH: 7.4 T: 2°C. Assay description: The assay uses purified enzyme interacting with biotinylated peptide substrate.HTRF is based on the proximity of europium cryptate (donor fluorophore...
In DepthDetails ArticlePubMed