BDBM151402 US8987314, B213
SMILES CS(=O)(=O)C(C(=O)NCCS(N)(=O)=O)c1nc2ccc(cc2s1)-c1cccc(OC(F)F)c1
InChI Key InChIKey=WPSIMTSHVSWYSP-UHFFFAOYSA-N
Data  2 IC50
  Tab Delimited (TSV)   2D SDfile   Computed 3D by Vconf -m prep SDfile
Find this compound or compounds like it in BindingDB:
Activity Spreadsheet -- Enzyme Inhibition Constant Data from BindingDB
Found 2 hits for monomerid = 151402
TargetHepatic triacylglycerol lipase(Homo sapiens (Human))
Bristol-Myers Squibb
US Patent
LigandPNGBDBM151402(US8987314, B213)
Affinity DataIC50:  3nMpH: 8.0 T: 2°C. Assay description: Endothelial lipase (EL) and hepatic lipase (HL) activities were measured using a fluorescent substrate, A10070, (Invitrogen, CA) doped into an artifi...
In DepthDetails US Patent
TargetEndothelial lipase(Homo sapiens (Human))
Bristol-Myers Squibb
US Patent
LigandPNGBDBM151402(US8987314, B213)
Affinity DataIC50:  2.80nMpH: 8.0 T: 2°C. Assay description: Endothelial lipase (EL) and hepatic lipase (HL) activities were measured using a fluorescent substrate, A10070, (Invitrogen, CA) doped into an artifi...
In DepthDetails US Patent