BDBM151959 US8987457, 153
SMILES C[C@H]1C[C@H](C[C@@H](N)[C@H]1OCCC#N)c1ccncc1NC(=O)c1ccc(F)c(n1)-c1c(F)cc(cc1F)C1(F)CCOCC1
InChI Key InChIKey=LLNGTXPGUYSOTJ-MKHVAHMFSA-N
Data  3 IC50
  Tab Delimited (TSV)   2D SDfile   Computed 3D by Vconf -m prep SDfile
Find this compound or compounds like it in BindingDB:
Activity Spreadsheet -- Enzyme Inhibition Constant Data from BindingDB
Found 3 hits for monomerid = 151959
TargetSerine/threonine-protein kinase pim-3(Homo sapiens (Human))
Novartis
US Patent
LigandPNGBDBM151959(US8987457, 153)
Affinity DataIC50:  1.45nM. Assay description: Pim 1, Pim 2 & Pim 3 AlphaScreen assays using high ATP (11-125.times. ATP Km) were used to determine the biochemical activity of the inhibitors. The ...
In DepthDetails US Patent
TargetSerine/threonine-protein kinase pim-2(Homo sapiens (Human))
Novartis
US Patent
LigandPNGBDBM151959(US8987457, 153)
Affinity DataIC50:  0.740nM. Assay description: Pim 1, Pim 2 & Pim 3 AlphaScreen assays using high ATP (11-125.times. ATP Km) were used to determine the biochemical activity of the inhibitors. The ...
In DepthDetails US Patent
TargetSerine/threonine-protein kinase pim-1(Homo sapiens (Human))
Novartis
US Patent
LigandPNGBDBM151959(US8987457, 153)
Affinity DataIC50:  0.0100nM. Assay description: Pim 1, Pim 2 & Pim 3 AlphaScreen assays using high ATP (11-125.times. ATP Km) were used to determine the biochemical activity of the inhibitors. The ...
In DepthDetails US Patent