BDBM152513 N-[4-{2-oxo-2-(4-phenylpiperazin-1-yl)ethoxy}phenyl]acetamide (1b)
SMILES CC(=O)Nc1ccc(OCC(=O)N2CCN(CC2)c2ccccc2)cc1
InChI Key InChIKey=RYZPBBXNXQRHIQ-UHFFFAOYSA-N
Data  1 KI  1 IC50
  Tab Delimited (TSV)   2D SDfile   Computed 3D by Vconf -m prep SDfile
Find this compound or compounds like it in BindingDB:
Activity Spreadsheet -- Enzyme Inhibition Constant Data from BindingDB
Found 1 hit for monomerid = 152513
TargetAcetylcholinesterase(Mus musculus (mouse))
Panjab University
LigandPNGBDBM152513(N-[4-{2-oxo-2-(4-phenylpiperazin-1-yl)ethoxy}pheny...)
Affinity DataKi:  4.37E+4nM IC50:  1.66E+3nMpH: 8.0Assay Description:An aliquot of diluted solution at five different concentration (1, 5, 10,15 and 25 µl) levels was mixed with phosphate buffer (pH 8.0, 3.0 ml), 100 µ...
In DepthDetails ArticlePubMed