BDBM153839 US8999981, A84::US8999981, A85
SMILES [H][C@@]1(CN2C[C@H](O)C[C@H]2CN1C(=O)N1Cc2c(NC(=O)c3ccccn3)n[nH]c2C1(C)C)[C@@H](C)CC
InChI Key
Data  2 KI
  Tab Delimited (TSV)   2D SDfile   Computed 3D by Vconf -m prep SDfile
Find this compound or compounds like it in BindingDB:
Activity Spreadsheet -- Enzyme Inhibition Constant Data from BindingDB
Found 2 hits for monomerid = 153839
TargetProtein kinase C beta type(Homo sapiens (Human))
Pfizer
US Patent
LigandPNGBDBM153839(US8999981, A84 | US8999981, A85)
Affinity DataKi:  15.2nM ΔG°:  -10.8kcal/molepH: 7.4 T: 2°C. Assay description: Protein Kinase C beta 2 (PKC beta II) catalyzes the production of ADP from ATP that accompanies the phosphoryl transfer to the PKC Pseudosubstrate pe...
In DepthDetails US Patent
TargetProtein kinase C beta type(Homo sapiens (Human))
Pfizer
US Patent
LigandPNGBDBM153839(US8999981, A84 | US8999981, A85)
Affinity DataKi:  139nM ΔG°:  -9.50kcal/molepH: 7.4 T: 2°C. Assay description: Protein Kinase C beta 2 (PKC beta II) catalyzes the production of ADP from ATP that accompanies the phosphoryl transfer to the PKC Pseudosubstrate pe...
In DepthDetails US Patent