BDBM155127 US9000184, 1
SMILES CC1=NC2(N=C1N)c1cc(Br)ccc1CCC21CC1
InChI Key InChIKey=HULILYYJZNMORD-UHFFFAOYSA-N
Data  1 IC50
  Tab Delimited (TSV)   2D SDfile   Computed 3D by Vconf -m prep SDfile
Find this compound or compounds like it in BindingDB:
Activity Spreadsheet -- Enzyme Inhibition Constant Data from BindingDB
Found 1 hit for monomerid = 155127
TargetBeta-secretase 1(Homo sapiens (Human))
Astrazeneca
US Patent
LigandPNGBDBM155127(US9000184, 1)
Affinity DataIC50:  4.87E+3nMpH: 2.5Assay Description:The beta -secretase enzyme used in the TR-FRET is prepared as follows:The cDNA for the soluble part of the human beta -Secretase (AA 1-AA 460) was cl...
In DepthDetails US Patent