BDBM15563 2-[4-({[(4R)-3-[(3R)-3-amino-4-(2-fluorophenyl)butanoyl]-1,3-thiazolidin-4-yl]formamido}methyl)phenyl]acetic acid::DPP-4 ligand 5
SMILES N[C@@H](CC(=O)N1CSC[C@H]1C(=O)NCc1ccc(CC(O)=O)cc1)Cc1ccccc1F
InChI Key InChIKey=MRWXMYCVFBXAGU-QUCCMNQESA-N
Data  1 IC50
  Tab Delimited (TSV)   2D SDfile   Computed 3D by Vconf -m prep SDfile
Find this compound or compounds like it in BindingDB:
Activity Spreadsheet -- Enzyme Inhibition Constant Data from BindingDB
Found 1 hit for monomerid = 15563
TargetDipeptidyl peptidase 4(Homo sapiens (Human))
Merck Research Laboratories
LigandPNGBDBM15563(2-[4-({[(4R)-3-[(3R)-3-amino-4-(2-fluorophenyl)but...)
Affinity DataIC50:  37nMpH: 7.5 T: 2°C. Assay description: The enzyme activity resulted in the formation of the fluorescent product amidomethylcoumarin (AMC), which was monitored by excitation at 360 nm and m...
In DepthDetails ArticlePubMed